HUMANITIES-THESAURUS
type: ConceptScheme

Πολιτικά αξιώματα
type: Concept
narrower: Κωλακρέτης (περίοδος πόλης-κράτους)
notation: 1696
preferred label: Political offices @en

Κωλακρέτης (περίοδος πόλης-κράτους)
type: Concept
contributor: Katsiadakis Helen (AA) @en
contributor: Κατσιαδάκη Ελένη (ΑΑ)
created: 2019-09-03
creator: Χρυσοβιτσάνος Γεράσιμος (ΑΑ)
creator: Chrysovitsanos Gerasimos (AA) @fr
modified: 2020-04-28
source: MacDowell 1970c
source: Aristotelis 1920
source: Harris 1995
source: Glotz 1994
status: Εκδοθείς
broader: Πολιτικά αξιώματα
in scheme: HUMANITIES-THESAURUS
notation: 1984
preferred label: Kolakretis (city-state period) @en
scope note: An office that first appears in ancient Athens. Kolakretai were officials in charge of managing public revenue and expenses. The term dates back to the Homeric years, when Kolakretai were persons responsible for the dismemberment and the sharing of the sacrificed animals. In later years Solon appointed them treasurers of the State Treasury. The office was abolished in 411 BC, and their duties were transferred to the Hellinotamies. @en
scope note: Αξίωμα που απαντά στην αρχαία Αθήνα. Οι κωλακρέτες ήταν αξιωματούχοι επιφορτισμένοι με τη διαχείριση των δημοσιών εσόδων και εξόδων. Ο όρος εμφανίζεται ήδη από τα ομηρικά χρόνια προσδίδοντας στα άτομα που έφεραν τον τίτλο την ιδιότητα των υπευθύνων για τον διαμελισμό και διαμοιρασμό των σφαγίων κατά την τέλεση θυσιών. Στα μεταγενέστερα χρόνια ο Σόλων τους όρισε ταμίες του κρατικού θησαυροφυλακίου. Το αξίωμα καταργείται το 411 π.Χ., οπότε και οι αρμοδιότητές τους πέρασαν στους Ελληνοταμίες.