HUMANITIES-THESAURUS
type: ConceptScheme

Πολιτικά αξιώματα
type: Concept
narrower: Άρχων βασιλεύς (περίοδος πόλης-κράτους)
notation: 1696
preferred label: Political offices @en

Άρχων βασιλεύς (περίοδος πόλης-κράτους)
type: Concept
contributor: Katsiadakis Helen (AA) @en
contributor: Κατσιαδάκη Ελένη (ΑΑ)
created: 2019-08-28
creator: Chrysovitsanos Gerasimos (AA) @fr
creator: Χρυσοβιτσάνος Γεράσιμος (ΑΑ)
modified: 2019-11-07
source: Aristotelis 1920
source: Gomme 1970d
status: Εκδοθείς
broader: Πολιτικά αξιώματα
in scheme: HUMANITIES-THESAURUS
notation: 1955
preferred label: Archon basileus (city-state period) @en
related: Άρχων (περίοδος πόλης-κράτους)
scope note: Αξίωμα που απαντά στην αρχαία Αθήνα. Ένας εκ των εννέα αρχόντων ο οποίος προήδρευε του Αρείου Πάγου και είχε υπό την εποπτεία του θρησκευτικές εορτές όπως τα Λήναια και τα Μυστήρια. Στην δικαιοδοσία του περιλαμβάνονταν υποθέσεις διεκδίκησης ιερατικών αξιωμάτων, ασέβειας και ανθρωποκτονιών.
scope note: An office that first appears in ancient Athens. One of the nine archons, he presided over the Areopagus and he was the supervisor of religious festivals like the Lenaea and the Mysteries. His jurisdiction included cases of claimants for priesthood, of impiety and of homicide. @en

Άρχων (περίοδος πόλης-κράτους)
type: Concept
notation: 1985
preferred label: Archon (city-state period) @en
related: Άρχων βασιλεύς (περίοδος πόλης-κράτους)