HUMANITIES-THESAURUS
type: ConceptScheme

Novel
type: Concept
narrower: Novel of manners
notation: 1731
preferred label: Μυθιστόρημα @el

Novel of manners
type: Concept
contributor: Κατσιαδάκη Ελένη (ΑΑ) @el
contributor: Katsiadakis Helen (AA)
created: 2019-07-26
creator: Καλαφατά Πατρίτσια (ΑΑ) @el
creator: Kalafata Patritsia (AA)
modified: 2020-10-19
source: Vitti 1978
source: Πολίτου-Μαρμαρινού 1984
source: Klarel 1999
source: Holman 1960
status: Εκδοθείς
broader: Novel
in scheme: HUMANITIES-THESAURUS
notation: 1912
preferred label: Ηθογραφικό μυθιστόρημα @el
related: Realism
scope note: Είδος μυθιστορήματος το οποίο αναπαριστά την κοινωνική πραγματικότητα καταγράφοντας λεπτομέρειες σχετικά με τα ήθη, τα έθιμα, τις αξίες και τις προσδοκίες μιας κοινωνικής ομάδας σε συγκεκριμένο χρόνο και τόπο. To είδος αυτό γνώρισε ιδιαίτερη ανάπτυξη κατά τον 19ο αιώνα. @el
scope note: Τype of novel which describes in detail the customs, values, mores and expectations of a certain social group at a specific time and place. The novel of manners flourished in the 19th century.

Realism
type: Concept
notation: 255
preferred label: Ρεαλισμός @el
related: Novel of manners