HUMANITIES-THESAURUS
type: ConceptScheme

Νόμοι (Επιγραφές δημοσίου χαρακτήρα)
type: Concept
notation: 1069
preferred label: Laws (Public inscriptions) @de
related: Γραφή παρανόμων

Γραφή παρανόμων
type: Concept
contributor: Chrysovitsanos Gerasimos (AA) @la
contributor: Χρυσοβιτσάνος Γεράσιμος (ΑΑ)
created: 2019-07-17
creator: Chrysovitsanos Gerasimos (AA) @en
creator: Χρυσοβιτσάνος Γεράσιμος (ΑΑ)
modified: 2019-10-29
source: Ζαββού 2007
status: Εκδοθείς
broader: Διαδικασίες
in scheme: HUMANITIES-THESAURUS
notation: 1862
preferred label: Graphe paranomon @en
related: Θεσμοθέτης (περίοδος πόλης-κράτους)
related: Επιγραφές (Επιγραφική)
related: Νόμοι (Επιγραφές δημοσίου χαρακτήρα)
scope note: A legal procedure that occurs in ancient Athens. According to Athenian law, a graphe was a public criminal prosecution. Through the graphe paranomon any citizen could bring an accusation against the proponent of any law or decree which in his view was illegal and seek to have it abolished, at the same time indicating which law it had contravened. A law or decree was illegal if it had any substantial or formal defects, such as the omission of the probouleuma from the council. @en
scope note: Διαδικασία νομικής φύσεως που απαντά στην αρχαία Αθήνα. Γραφή στο αθηναϊκό δίκαιο ήταν η δημόσια ποινική κατηγορία και δίωξη. Με τη γραφή παρανόμων κάθε πολίτης μπορούσε να διατυπώνει κατηγορία εναντίον του εισηγητή οποιουδήποτε νόμου ή ψηφίσματος που του φαινόταν παράνομος και να επιδιώκει την κατάργησή του, υποδεικνύοντας συγχρόνως τον νόμο που είχε παραβιαστεί. Παράνομος μπορούσε να θεωρηθεί ένας νόμος ή ψήφισμα όταν παρουσίαζε ουσιαστικά ή τυπικά ελαττώματα, όπως παράλειψη προβουλεύματος της βουλής.

Θεσμοθέτης (περίοδος πόλης-κράτους)
type: Concept
notation: 1956
preferred label: Thesmothetis (city-state period) @en
related: Γραφή παρανόμων

Διαδικασίες
type: Concept
narrower: Γραφή παρανόμων
notation: 285
preferred label: Procedures @en

Επιγραφές (Επιγραφική)
type: Concept
notation: 69
preferred label: Inscriptions (Epigraphy) @en
related: Γραφή παρανόμων