HUMANITIES-THESAURUS
type: ConceptScheme

Πολεμικά γεγονότα
type: Concept
narrower: Πολιορκίες
notation: 1852
preferred label: War events @en

Πολιορκίες
type: Concept
contributor: Katsiadakis Helen (AA) @en
contributor: Κατσιαδάκη Ελένη (ΑΑ)
created: 2019-07-16
creator: Τζεδόπουλος Γιώργος (ΑΑ)
creator: Tzedopoulos Giorgos (AA) @de
modified: 2020-04-02
source: Corfis and Wolfe 1995
status: Εκδοθείς
broader: Πολεμικά γεγονότα
in scheme: HUMANITIES-THESAURUS
notation: 1855
preferred label: Sieges @en
scope note: Military blockades from land and/or sea of an inhabited and/or fortified place aiming at its capture by assault or surrender. Sieges often include strike operations against the defenders, but they are mostly based on exercising pressure through the cutting of supply lines, which can lead the besieged to negotiations for surrender. @en
scope note: Στρατιωτικοί αποκλεισμοί από ξηρά ή/και θάλασσα ενός κατοικημένου τόπου ή οχυρωμένου σημείου με στόχο την κατάληψή του με επίθεση ή με παράδοση. Οι πολιορκίες συχνά περιλαμβάνουν επιχειρήσεις πλήξεως του αμυνόμενου, αλλά βασίζονται κυρίως στην άσκηση πίεσης μέσω της διακοπής κάθε είδους ανεφοδιασμού, που μπορεί να οδηγήσει τους πολιορκημένους σε διαπραγματεύσεις για παράδοση.