HUMANITIES-THESAURUS
type: ConceptScheme

Δολιοφθορές
type: Concept
contributor: Katsiadakis Helen (AA) @en
contributor: Κατσιαδάκη Ελένη (ΑΑ)
created: 2019-07-16
creator: Τζεδόπουλος Γιώργος (ΑΑ)
creator: Tzedopoulos Giorgos (AA) @de
modified: 2020-04-02
source: Zander 2017
status: Εκδοθείς
broader: Εμπρόθετες καταστροφές
in scheme: HUMANITIES-THESAURUS
notation: 1850
preferred label: Sabotage @en
scope note: Deliberate action by small army or guerilla groups, or even by activists associated with social movements, aiming at damaging means of production or infrastructure in order to weaken a government in times of internal conflict or war. During World War II anti-German resistance groups in Europe practiced effective sabotage against factories, military installations, railroads, bridges etc. Sabotage became a basic strategy of insurgent groups associated with anticolonial and separatist movements. @en
scope note: Εμπρόθετες δράσεις εκ μέρους μικρών στρατιωτικών και ανταρτικών ομάδων ή και ομάδων κρούσης κοινωνικών κινημάτων με στόχο την πρόκληση ζημιών σε μέσα παραγωγής ή υποδομές ώστε να αποδυναμωθεί μια κυβέρνηση κατά τη διάρκεια εσωτερικών συγκρούσεων ή πολέμου. Κατά τον Β΄ Παγκόσμιο Πόλεμο οι ομάδες αντίστασης κατά των Γερμανών στην Ευρώπη επιδόθηκαν σε δολιοφθορές ενάντια σε εργοστάσια, στρατιωτικές εγκαταστάσεις, σιδηροδρόμους, γέφυρες κλπ. Οι δολιοφθορές έγιναν μία από τις βασικές στρατηγικές ανταρτικών ομάδων που συνδέονται με αντιαποικιοκρατικά και αποσχιστικά κινήματα.

Εμπρόθετες καταστροφές
type: Concept
narrower: Δολιοφθορές
notation: 19
preferred label: Intentional destructions @en