HUMANITIES-THESAURUS
type: ConceptScheme

Εθνοκαθάρσεις
type: Concept
narrower: Γενοκτονίες
notation: 1844
preferred label: Ethnic cleansing @en

Γενοκτονίες
type: Concept
contributor: Katsiadakis Helen (AA) @en
contributor: Κατσιαδάκη Ελένη (ΑΑ)
created: 2019-07-16
creator: Τζεδόπουλος Γιώργος (ΑΑ)
creator: Tzedopoulos Giorgos (AA) @de
modified: 2019-11-07
source: Rubinstein 2004
status: Εκδοθείς
broader: Εθνοκαθάρσεις
in scheme: HUMANITIES-THESAURUS
notation: 1845
preferred label: Genocides @en
scope note: Εμπρόθετες και συντονισμένες ενέργειες για την ολοκληρωτική -ή σε ζωτικό βαθμό- εξάλειψη μιας φυλετικής, εθνοτικής, θρησκευτικής ή κοινωνικής ομάδας. Ο όρος χρησιμοποιήθηκε μετά τον Β΄ Παγκόσμιο Πόλεμο για να δηλωθεί μια κατηγορία εγκλημάτων πολέμου και έχει εσαχθεί στο διεθνές δίκαιο. Η χρήση του στην ιστοριογραφία, ωστόσο, είναι προβληματική, καθώς οι συνθήκες που περιβάλλουν τα φαινόμενα μαζικών σφαγών στην ιστορία είναι σύνθετες και συχνά αντιφατικές, με αποτέλεσμα να είναι δύσκολο να οριστούν με "τυπικό τρόπο" κάποια από αυτά τα φαινόμενα ως γενοκτονίες, σε αντίθεση με άλλα.
scope note: Intentional and coordinated actions aiming at the total -or to a great extent- annhihilation of a racial, ethnic, religious or social group. The term was used after World War II to designate a category of war crimes and has been adopted by international law. Its use in historiography, however, is problematic, since the conditions, under which mass killings emerge in history, are complex and often contradictory. Therefore, it is difficult to define typically some of those phenomena as genocides in contrast to others. @en