HUMANITIES-THESAURUS
type: ConceptScheme

Εθνοκαθάρσεις
type: Concept
contributor: Katsiadakis Helen (AA) @en
contributor: Κατσιαδάκη Ελένη (ΑΑ)
created: 2019-07-16
creator: Tzedopoulos Giorgos (AA) @de
creator: Τζεδόπουλος Γιώργος (ΑΑ)
modified: 2020-04-08
source: Ther 2014
status: Εκδοθείς
broader: Εμπρόθετες καταστροφές
in scheme: HUMANITIES-THESAURUS
narrower: Γενοκτονίες
notation: 1844
preferred label: Ethnic cleansing @en
scope note: Εμπρόθετες και συντονισμένες ενέργειες για την ολοκληρωτική -ή σε ζωτικό βαθμό- εξάλειψη της παρουσίας μιας εθνοτικής, ή εθνικής ομάδας από περιοχές που είτε ανήκουν στην επικράτεια ενός κράτους είτε υπόκεινται στον έλεγχό του υπό συνθήκες πολεμικής κατοχής. Η εθνοκάθαρση επιδιώκεται με επιχειρήσεις μαζικών σφαγών από στρατιωτικά ή παραστρατιωτικά σώματα, με αναγκαστικούς εκπατρισμούς, εκτοπισμούς και μεταναστεύσεις, ή (κατά κανόνα) με συνδυασμό των παραπάνω. Ο όρος χρησιμοποιείται ευρέως μετά τις εθνοτικές συγκρούσεις κατά τη διάρκεια του εμφύλιου πολέμου της Γιουγκοσλαβίας. Πρέπει να σημειωθεί πως η εθνοκάθαρση αναφέρεται σε προσπάθεια εξάλειψης της παρουσίας της εκάστοτε στοχοποιημένης ομάδας και όχι αναγκαστικά στην ολοκληρωτική της εξόντωση, όπως συμβαίνει με τη γενοκτονία.
scope note: Intentional and coordinated actions aiming at the total -or to a great extent- elimination of an ethnic or national group from regions that either belong to a state's territory or are under its control in conditions of military occupation during war. Ethnic cleansing is pursued through mass murder by military or paramilitary groups, through forced expatriation, deportation and emigration, or (most often) through a combination of the above. The term is widely used after the ethnic conflicts that took place during the civil war of Yugoslavia. @en

Γενοκτονίες
type: Concept
broader: Εθνοκαθάρσεις
notation: 1845
preferred label: Genocides @en

Εμπρόθετες καταστροφές
type: Concept
narrower: Εθνοκαθάρσεις
notation: 19
preferred label: Intentional destructions @en