HUMANITIES-THESAURUS
type: ConceptScheme

Επιδημίες
type: Concept
narrower: Πανδημίες
notation: 1837
preferred label: Epidemics @en

Πανδημίες
type: Concept
contributor: Κατσιαδάκη Ελένη (ΑΑ)
contributor: Katsiadakis Helen (AA) @en
created: 2019-07-16
creator: Τζεδόπουλος Γιώργος (ΑΑ)
creator: Tzedopoulos Giorgos (AA) @de
modified: 2020-04-02
source: Hays 2005
status: Εκδοθείς
broader: Επιδημίες
in scheme: HUMANITIES-THESAURUS
notation: 1838
preferred label: Pandemics @en
related: Επαγγελματίες υγείας
related: Νοσοκομεία
related: Ιατρική
scope note: Epidemics that expand over a very large geographical scale and even over the largest part of the planet, and which have important demographic, economic and social consequences on a global scale. @en
scope note: Επιδημίες που εξαπλώνονται σε πολύ μεγάλη γεωγραφική κλίμακα ή και στο μεγαλύτερο μέρος του πλανήτη με μεγάλου μεγέθους δημογραφικές, οικονομικές και κοινωνικές συνέπειες σε παγκόσμιο επίπεδο.

Νοσοκομεία
type: Concept
notation: 2102
preferred label: Hospitals @en
related: Πανδημίες

Επαγγελματίες υγείας
type: Concept
notation: 2190
preferred label: Health professionals @en
related: Πανδημίες

Ιατρική
type: Concept
notation: 2377
preferred label: Medicine @en
related: Πανδημίες