HUMANITIES-THESAURUS
type: ConceptScheme

Φυσικές καταστροφές
type: Concept
narrower: Πλημμύρες
notation: 14
preferred label: Natural disasters @en

Πλημμύρες
type: Concept
contributor: Κατσιαδάκη Ελένη (ΑΑ)
contributor: Katsiadakis Helen (AA) @en
created: 2019-07-16
creator: Tzedopoulos Giorgos (AA) @de
creator: Τζεδόπουλος Γιώργος (ΑΑ)
modified: 2020-04-02
source: Collier & Webb 2002
status: Εκδοθείς
broader: Φυσικές καταστροφές
in scheme: HUMANITIES-THESAURUS
notation: 1834
preferred label: Floods @en
scope note: Φαινόμενα υπερχείλισης νερού που καλύπτει την ξηρά και μπορεί να έχει καταστροφικές επιπτώσεις στην έμβια ζωή και στις ανθρώπινες εγκαταστάσεις στη θιγόμενη περιοχή. Οι πλημμύρες οφείλονται σε αυξημένη βροχόπτωση (ειδικά σε κορεσμένο από νερό έδαφος) ή και σε τήξη μαζών πάγου ή χιονιού, συχνά σε συνδυασμό με γεωμορφολογικά και υδρολογικά χαρακτηριστικά που εμποδίζουν το νερό να απορροφηθεί ή να διοχετευθεί προς τη θάλασσα.
scope note: Phenomena of water overflow over dry land that can have disastrous effects on living beings and human establishments in the affected areas. Floods are caused by excessive rainfall (especially on saturated ground) and by snow or ice melt, often in combination with geomorphological and hydrological characteristics that prevent water from infiltrating the ground or running off toward the sea. @en