HUMANITIES-THESAURUS
type: ConceptScheme

Φυσικές καταστροφές
type: Concept
narrower: Σεισμοί
notation: 14
preferred label: Natural disasters @en

Σεισμοί
type: Concept
contributor: Katsiadakis Helen (AA) @la
contributor: Κατσιαδάκη Ελένη (ΑΑ)
created: 2019-07-16
creator: Τζεδόπουλος Γιώργος (ΑΑ)
creator: Tzedopoulos Giorgos (AA) @de
modified: 2020-04-02
source: de Boer & Sanders 2005
status: Εκδοθείς
broader: Φυσικές καταστροφές
in scheme: HUMANITIES-THESAURUS
notation: 1832
preferred label: Earthquakes @en
related: Σεισμογράφοι
related: Σεισμολογία
scope note: Βίαιες αναταράξεις της επιφάνειας της γης που οφείλονται στην ξαφνική έκλυση ενέργειας στην περιοχή της λιθόσφαιρας, όπως η σύγκρουση των τεκτονικών πλακών. Οι ισχυροί σεισμοί, συχνά σε συνδυασμό με άλλα φαινόμενα (π.χ. ηφαιστειακές εκρήξεις), έχουν προκαλέσει μεγάλες καταστροφές στα έμβια όντα και ειδικότερα στις ανθρώπινες εγκαταστάσεις και κοινωνικές δομές (πυρκαγιές, καταρρεύσεις, πλημμύρες, τσουνάμι, κατολισθήσεις κλπ.).
scope note: Violent tremors of the earth's surface due to the sudden release of energy in the lithosphere, like the collision of tectonic plates. Powerful earthquakes, often combined with other phenomena (e.g. volcanic eruptions), have provoked major catastrophes among living beings and in human establishments and social structures (fire, collapse of buildings, flood, tsunami, landslide etc.). @en

Σεισμολογία
type: Concept
notation: 2520
preferred label: Seismology @en
related: Σεισμοί

Σεισμογράφοι
type: Concept
notation: 2600
preferred label: Seismographs @en
related: Σεισμοί