HUMANITIES-THESAURUS
type: ConceptScheme

Αεροπορικοί βομβαρδισμοί
type: Concept
contributor: Κατσιαδάκη Ελένη (ΑΑ)
contributor: Katsiadakis Helen (AA) @en
created: 2019-07-16
creator: Tzedopoulos Giorgos (AA) @de
creator: Τζεδόπουλος Γιώργος (ΑΑ)
modified: 2020-03-27
source: Hippler 2017
status: Εκδοθείς
broader: Εμπρόθετες καταστροφές
in scheme: HUMANITIES-THESAURUS
notation: 1831
preferred label: Aerial bombings @en
related: Πολεμικά γεγονότα
scope note: Military operations aiming at destroying the infrastructure of the enemy, at demoralising him and at forcing him to surrender. Aerial bombings, which emerged in the framework of the total wars of the 20th century, have been often implemented against civilian targets and have caused immense casualties. @en
scope note: Στρατιωτικές επιχειρήσεις που στοχεύουν στην καταστροφή υποδομών του εχθρού, στην απώλεια του ηθικού του και στον εξαναγκασμό του σε συνθηκολόγηση. Οι αεροπορικοί βομβαρδισμοί, οι οποίοι αναδύθηκαν στη λογική των ολοκληρωτικών πολέμων του 20ού αιώνα, έχουν συχνά χρησιμοποιηθεί εναντίον αμάχων προκαλώντας τεράστιες απώλειες.

Πολεμικά γεγονότα
type: Concept
notation: 1852
preferred label: War events @en
related: Αεροπορικοί βομβαρδισμοί

Εμπρόθετες καταστροφές
type: Concept
narrower: Αεροπορικοί βομβαρδισμοί
notation: 19
preferred label: Intentional destructions @en