HUMANITIES-THESAURUS
type: ConceptScheme

Νομισματική
type: Concept
notation: 1444
preferred label: Numismatics @en
related: Στεφανηφόρα (νομίσματα)

Νομίσματα (πληροφοριακά αντικείμενα)
type: Concept
narrower: Στεφανηφόρα (νομίσματα)
notation: 1445
preferred label: Coins (information objects) @en

Στεφανηφόρα (νομίσματα)
type: Concept
contributor: Κατσιαδάκη Ελένη (ΑΑ)
contributor: Katsiadakis Helen (AA) @en
created: 2019-07-15
creator: Ιακωβίδου Αθηνά (ΑΑ)
creator: Iakovidou Athena (AA) @fr
modified: 2020-05-06
source: Meadows & Houghton 2010
source: Thompson 1961
source: Mørkholm 1984
source: Kroll 1993
status: Εκδοθείς
alternative label: Νέας τεχνοτροπίας
alternative label: New Style @en
broader: Νομίσματα (πληροφοριακά αντικείμενα)
in scheme: HUMANITIES-THESAURUS
notation: 1826
preferred label: Stephanephora (coins) @en
related: Αργυρά νομίσματα
related: Νομισματική
scope note: Silver Athenian tetradrachms and drachms of the 2nd and 1st c. BCE. Stephanephora derived their name from their reverse which depicts an owl surrounded by a laurel wreath. The exact date of their introduction is still a matter of controversy among researchers. In modern bibliography they are called New Style coins. @en
scope note: Αργυρά αθηναϊκά τετράδραχμα και δραχμές του 2ου και 1ου αι. π.Χ. Ονομάστηκαν έτσι γιατί στην οπίσθια όψη έφεραν κουκουβάγια γύρω από δάφνινο στεφάνι. Η ακριβής χρονολογία εισαγωγής τους παραμένει ακόμα αντικείμενο συζητήσεων. Στην σύγχρονη βιβλιογραφία ονομάζονται νομίσματα Νέας Τεχνοτροπίας.

Αργυρά νομίσματα
type: Concept
notation: 2351
preferred label: Silver coins @en
related: Στεφανηφόρα (νομίσματα)