HUMANITIES-THESAURUS
type: ConceptScheme

Νομισματική
type: Concept
notation: 1444
preferred label: Numismatics @en
related: Maiorinas

Νομίσματα (πληροφοριακά αντικείμενα)
type: Concept
narrower: Maiorinas
notation: 1445
preferred label: Coins (information objects) @en

Νούμμιοι
type: Concept
notation: 1504
preferred label: Nummi @en
related: Maiorinas

Maiorinas
type: Concept
contributor: Katsiadakis Helen (AA) @en
contributor: Κατσιαδάκη Ελένη (ΑΑ)
created: 2019-07-11
creator: Ιακωβίδου Αθηνά (ΑΑ)
creator: Iakovidou Athena (AA) @en
modified: 2020-04-03
source: Amandry, Dhénin, Popoff, Thierry, & Vellet 2002
status: Εκδοθείς
broader: Νομίσματα (πληροφοριακά αντικείμενα)
in scheme: HUMANITIES-THESAURUS
notation: 1818
related: Νομισματική
related: Νούμμιοι
scope note: Argentiferous copper-alloy Roman coins which replaced nummi during the monetary reform of Diocletian in 348 CE, and weighed 1/60 of a libra. They were replaced by Julian in 362 CE by a large coin weighing 1/36 of a libra. @en
scope note: Ρωμαϊκά νομίσματα από κράμα χαλκού με ελάχιστη πρόσμειξη αργύρου. Κατά την νομισματική μεταρρύθμιση του Διοκλητιανού, το 348 μ.Χ., αντικατέστησαν τους νούμμιους και το βάρος τους αντιστοιχούσε στο 1/60 της λίβρας. Aντικαταστάθηκαν με την σειρά τους από τον Ιουλιανό, το 362 μ.Χ., από ένα μεγάλο νόμισμα που ζύγιζε 1/36 της λίβρας.