HUMANITIES-THESAURUS
type: ConceptScheme

Παραμάνες
type: Concept
contributor: Φαλιέρου Αναστασία (ΑΑ)
contributor: Falierou Anastasia (AA) @fr
created: 2019-07-08
creator: Falierou Anastasia (AA) @la
creator: Φαλιέρου Αναστασία (ΑΑ)
modified: 2020-10-20
source: Χαραλαμπάκης 2014
status: Εκδοθείς
alternative label: Nannies @en
alternative label: Τροφοί
alternative label: Νταντάδες
broader: Ιστορικές επαγγελματικές ομάδες
in scheme: HUMANITIES-THESAURUS
notation: 1813
preferred label: Wet nurses @en
scope note: Γυναίκες που θήλαζαν ένα ξένο βρέφος έναντι αμοιβής ή/και αναλάμβαναν την ανατροφή του.
scope note: Women who nursed/ breast-fed another woman’s infant for a fee and / or undertook its upbringing. @en

Ιστορικές επαγγελματικές ομάδες
type: Concept
narrower: Παραμάνες
notation: 2636
preferred label: Historical occupational groups @en