HUMANITIES-THESAURUS
type: ConceptScheme

Νομισματική
type: Concept
notation: 1444
preferred label: Numismatics @en
related: Τάλαντα

Νομίσματα (πληροφοριακά αντικείμενα)
type: Concept
notation: 1445
preferred label: Coins (information objects) @en
related: Τάλαντα

Τάλαντα
type: Concept
contributor: Κατσιαδάκη Ελένη (ΑΑ)
contributor: Katsiadakis Helen (AA) @en
created: 2019-06-28
creator: Iakovidou Athena (AA) @fr
creator: Ιακωβίδου Αθηνά (ΑΑ)
modified: 2020-04-05
source: Κρεμύδη 2009
source: Παπαευθυμίου 2010
status: Εκδοθείς
broader: Προκερματικά μέσα συναλλαγής
in scheme: HUMANITIES-THESAURUS
notation: 1804
preferred label: Talents @en
related: Νομίσματα (πληροφοριακά αντικείμενα)
related: Νομισματική
scope note: Τάλαντο είναι πλάκα χαλκού σε σχήμα τεντωμένου δέρματος ζώου (δοράς βοοειδούς), το οποίο ήταν σε χρήση ως μέσο συναλλαγής κατά την προκερματική περίοδο. Αργότερα, το τάλαντο αποτέλεσε μονάδα βάρους, η οποία π.χ. στον αττικό σταθμητικό κανόνα, αντιστοιχούσε σε 60 μνες ή 6000 αττικές δραχμές και ζύγιζε 26 κιλά και 196 γραμμάρια.
scope note: A talent is a copper ingot in the shape of an ox-hide, in use as a medium of exchange before the invention of coinage. Later on, it was used as a unit of weight; an Attic talent, e.g. was the equivalent of 60 minas or 6,000 drachms and its weight was 26.196 kg. @en

Προκερματικά μέσα συναλλαγής
type: Concept
narrower: Τάλαντα
notation: 2277
preferred label: Premonetary means of exchange @en