HUMANITIES-THESAURUS
type: ConceptScheme

Θρησκευτικά αξιώματα
type: Concept
narrower: Ιεροποιός (περίοδος πόλης-κράτους)
notation: 1583
preferred label: Religious offices @en

Ιεροποιοί
type: Concept
notation: 1744
preferred label: Hieropoioi @en
related: Ιεροποιός (περίοδος πόλης-κράτους)

Ιεροποιός (περίοδος πόλης-κράτους)
type: Concept
contributor: Κατσιαδάκη Ελένη (ΑΑ)
contributor: Katsiadakis Helen (AA) @en
created: 2019-06-28
creator: Χρυσοβιτσάνος Γεράσιμος (ΑΑ)
creator: Chrysovitsanos Gerasimos (AA) @fr
modified: 2019-11-07
source: Harris 1995
source: Glotz 1994
status: Εκδοθείς
broader: Θρησκευτικά αξιώματα
in scheme: HUMANITIES-THESAURUS
notation: 1795
preferred label: Hieropoios (city-state period) @en
related: Ιεροποιοί
scope note: Τα μέλη της επιτροπής των Ιεροποιών κατείχαν το αξίωμα του Ιεροποιoύ με κύριο καθήκον την επίβλεψη ιερών τελετών και θυσιών είτε σε μεγάλες εορτές είτε σε ιερά και ναούς.
scope note: The members of the sacred commission (Hieropoioi) held the office of the Hieropoios with the primary task of overseeing sacred ceremonies and sacrifices, either on great feasts or in sanctuaries and temples. @en