HUMANITIES-THESAURUS
type: ConceptScheme

Ενθρονίσεις
type: Concept
contributor: Κατσιαδάκη Ελένη (ΑΑ)
contributor: Katsiadakis Helen (AA) @en
created: 2019-06-27
creator: Tzedopoulos Giorgos (AA) @de
creator: Τζεδόπουλος Γιώργος (ΑΑ)
modified: 2020-09-07
source: Bell 1997
status: Εκδοθείς
broader: Πολιτικά - κοινωνικά - οικονομικά γεγονότα
in scheme: HUMANITIES-THESAURUS
notation: 1794
preferred label: Enthronements @en
scope note: Ritual events that accompany a person's accession to kingship or highest ecclesiastical office. As a rule, enthronements follow a specific ceremony that conveys symbolic legitimation to the person and the office, reinforces the claims of power that derive from the office, and invokes a representation of the social and political order that the office is considered to embody. @en
scope note: Τελετουργικές εκδηλώσεις αναβίβασης προσώπων σε βασιλικό ή υψηλότατο εκκλησιαστικό αξίωμα. Οι ενθρονίσεις ακολουθούν κατά κανόνα ένα συγκεκριμένο τυπικό, το οποίο λειτουργεί ως φορέας συμβολικής νομιμοποίησης του προσώπου και του αξιώματος, ως έκφραση των αξιώσεων ισχύος που απορρέουν από το αξίωμα και ως όχημα αναπαράστασης της κοινωνικής και πολιτικής τάξης που θεωρείται πως ενσαρκώνει το αξίωμα.

Πολιτικά - κοινωνικά - οικονομικά γεγονότα
type: Concept
narrower: Ενθρονίσεις
notation: 315