HUMANITIES-THESAURUS
type: ConceptScheme

Θρησκευτικά γεγονότα
type: Concept
narrower: Σχίσματα
notation: 1790
preferred label: Religious events @en

Σχίσματα
type: Concept
contributor: Katsiadakis Helen (AA) @en
contributor: Κατσιαδάκη Ελένη (ΑΑ)
created: 2019-06-27
creator: Τζεδόπουλος Γιώργος (ΑΑ)
creator: Tzedopoulos Giorgos (AA) @de
modified: 2019-07-21
source: Lewis & Lewis 2009
status: Εκδοθείς
broader: Θρησκευτικά γεγονότα
in scheme: HUMANITIES-THESAURUS
notation: 1792
preferred label: Schisms @en
scope note: Schisms are complex events that lead to the splitting of a more or less unified religious group and organisation into two or more distinct parts. Schisms arise out of conflict and controversy not only on theological, but mainly on political and social issues. The opposite groups that emerge from schisms often stigmatise one another as heretic or schismatic, and claim for themselves dogmatic purity and institutional legitimacy. @en
scope note: Σύνθετα γεγονότα που οδηγούν στη διάσπαση μιας λιγότερο ή περισσότερο ενιαίας θρησκευτικής ομάδας ή θρησκευτικού οργανισμού σε δύο ή περισσότερα διακριτά μέρη. Τα σχίσματα προκύπτουν από συγκρούσεις και διαμάχες όχι μόνο επί θεολογικών, αλλά κυρίως επί πολιτικών και κοινωνικών ζητημάτων. Οι αντιτιθέμενες ομάδες που ανδύονται από τα σχίσματα συχνά αλληλοστιγματίζονται ως αιρετικές ή σχισματικές και αξιώνουν για τον εαυτό τους δογματική καθαρότητα και θεσμική νομιμοποίηση.