HUMANITIES-THESAURUS
type: ConceptScheme

Πολιτικά αξιώματα
type: Concept
narrower: Χαλίφης
notation: 1696
preferred label: Political offices @en

Χαλίφης
type: Concept
contributor: Katsiadakis Helen (AA) @en
contributor: Κατσιαδάκη Ελένη (ΑΑ)
created: 2019-06-24
creator: Tzedopoulos Giorgos (AA) @en
creator: Τζεδόπουλος Γιώργος (ΑΑ)
modified: 2020-04-03
source: Campo 2009
status: Εκδοθείς
broader: Μουσουλμανικά θρησκευτικά αξιώματα
broader: Πολιτικά αξιώματα
in scheme: HUMANITIES-THESAURUS
notation: 1782
preferred label: Caliph @en
scope note: Ruler of the Islamic community, conceived as successor of the prophet Muhammad and head of a Muslim state that claims legitimacy over all Muslims. @en
scope note: Ηγέτης της κοινότητας των πιστών του Ισλάμ, θεωρούμενος ως διάδοχος του προφήτη Μωάμεθ, και επικεφαλής ενός κράτους με αξιώσεις νομιμοποίησης επί όλων των μουσουλμάνων.

Μουσουλμανικά θρησκευτικά αξιώματα
type: Concept
narrower: Χαλίφης
notation: 1783
preferred label: Muslim religious offices @en