HUMANITIES-THESAURUS
type: ConceptScheme

Οικοδομικές επιγραφές
type: Concept
notation: 1082
preferred label: Building inscriptions @en
related: Συγγραφές (περίοδος πόλης-κράτους)

Συγγραφείς (περίοδος πόλης-κράτους)
type: Concept
notation: 1767
preferred label: Syngrapheis (city-state period) @en
related: Συγγραφές (περίοδος πόλης-κράτους)

Συγγραφές (περίοδος πόλης-κράτους)
type: Concept
contributor: Katsiadakis Helen (AA) @en
contributor: Κατσιαδάκη Ελένη (ΑΑ)
created: 2019-06-24
creator: Χρυσοβιτσάνος Γεράσιμος (ΑΑ)
creator: Chrysovitsanos Gerasimos (AA) @la
modified: 2019-10-27
source: Ζαββού 2007
status: Εκδοθείς
broader: Πληροφοριακά αντικείμενα
in scheme: HUMANITIES-THESAURUS
notation: 1777
preferred label: Syngraphai (city-state period) @en
related: Συγγραφείς (περίοδος πόλης-κράτους)
related: Συγγραφεύς (περίοδος πόλης-κράτους)
related: Οικοδομικές επιγραφές
scope note: Τύπος μελέτης για δημόσια έργα που εκπονούσαν ειδικές επιτροπές (συγγραφείς) στην αρχαία Αθήνα. Πρόκειται για την πρόταση των συγγραφέων, δηλαδή τη γενική περιγραφή του δημόσιου έργου, μία οικονομοτεχνική μελέτη που συνήθως αφορούσε τμήματα ενός έργου, ενώ κατά τμήματα μπορούσε να γίνει και η ανάθεση του έργου.
scope note: Type of study for public works prepared by specialised committees (syngrapheis) in ancient Athens. This is the proposal of the syngrapheis, i.e. the general description of the public work, a financial and technical study which was usually related to parts of the construction. Construction projects could be assigned in sections. @en

Συγγραφεύς (περίοδος πόλης-κράτους)
type: Concept
notation: 1778
preferred label: Syngrapheys (city-state period) @en
related: Συγγραφές (περίοδος πόλης-κράτους)

Πληροφοριακά αντικείμενα
type: Concept
narrower: Συγγραφές (περίοδος πόλης-κράτους)
notation: 240
preferred label: Information objects @en