HUMANITIES-THESAURUS
type: ConceptScheme

Επίσκοπος
type: Concept
narrower: Μητροπολίτης
notation: 1655
preferred label: Bishop @en

Μητροπολίτης
type: Concept
contributor: Katsiadakis Helen (AA) @en
contributor: Κατσιαδάκη Ελένη (ΑΑ)
created: 2019-06-24
creator: Τζεδόπουλος Γιώργος (ΑΑ)
creator: Tzedopoulos Giorgos (AA) @fr
modified: 2019-08-20
status: Εκδοθείς
broader: Επίσκοπος
in scheme: HUMANITIES-THESAURUS
notation: 1769
preferred label: Metropolitan bishop @en
scope note: Επίσκοπος που είναι επικεφαλής μιας (συνήθως μείζονος) εκκλησιαστικής περιφέρειας (μητρόπολη). Το αξίωμα ανάγεται στα πρωτοχριστιανικά χρόνια, όταν ο μητροπολίτης ήταν ο επίσκοπος της πρωτεύουσας μιας ρωμαϊκής επαρχίας. Η θέση του μητροπολίτη σε σχέση με το κοντινό αξίωμα του αρχιεπισκόπου, όπως και σε σχέση με το διοικητικό εκκλησιαστικό καθεστώς εν γένει, παρουσιάζει κάποιες διαφορές μεταξύ της Καθολικής, της Ορθόδοξης, της Ανατολικής Ορθόδοξης και της Αγγλικανικής Εκκλησίας.
scope note: Bishop who is the head of a -usually major- ecclesiastical administrative unit (metropolis). The office originates in the early Christian era, when the metroplitan was the bishop of the capital of a Roman province. The position of the metropolitan vis-à-vis the closely related office of archbishop, as well as in the framework of the overall ecclesiastical adminisrtative system, differs in the Catholic, Eastern Orthodox, Oriental Orthoidox and Anglican Churches. @en