HUMANITIES-THESAURUS
type: ConceptScheme

Πολιτικά αξιώματα
type: Concept
narrower: Βασιλιάς
notation: 1696
preferred label: Political offices @en

Βασιλιάς
type: Concept
contributor: Katsiadakis Helen (AA) @en
contributor: Κατσιαδάκη Ελένη (ΑΑ)
created: 2019-06-12
creator: Tzedopoulos Giorgos (AA) @la
creator: Τζεδόπουλος Γιώργος (ΑΑ)
modified: 2019-11-07
source: Ponting 2001
source: Hani 2011
status: Εκδοθείς
broader: Πολιτικά αξιώματα
in scheme: HUMANITIES-THESAURUS
notation: 1753
preferred label: King @en
scope note: Leader of a monarchical state. Kingship is usually hereditary and the king's power may be absolute or restricted, or his role may be purely ceremonial and symbolic. In many regions of the world kingship had been for centuries invested with sacral meaning and was regarded as a manifestation of divine will. @en
scope note: Ηγέτης ενός μοναρχικού κράτους. Το βασιλικό αξίωμα είναι συνήθως κληρονομικό και ο βασιλιάς μπορεί να ασκεί απολυταρχική εξουσία ή να υφίσταται περιορισμούς, ή και να περιορίζεται σε εθιμοτυπικό και συμβολικό ρόλο. Σε πολλές περιοχές του κόσμου το βασιλικό αξίωμα είχε επί αιώνες περιβληθεί την αίγλη της ιερότητας και της έκφρασης της θείας βούλησης.