HUMANITIES-THESAURUS
type: ConceptScheme

Μελισσοκομία
type: Concept
contributor: Κατσιαδάκη Ελένη (ΑΑ)
contributor: Katsiadakis Helen (AA) @en
created: 2019-05-22
creator: Ιακωβίδου Αθηνά (ΑΑ)
creator: Iakovidou Athena (AA) @la
modified: 2019-08-20
source: Britannica Concise Encyclopedia 2006
status: Εκδοθείς
broader: Κτηνοτροφία
in scheme: HUMANITIES-THESAURUS
notation: 1703
preferred label: Beekeeping @en
scope note: Συστηματική φροντίδα και διαχείριση μελισσών, ούτως ώστε να παράξουν και να αποθηκεύσουν περίσσια μελιού, προκείμενου αυτό να συλλεχθεί. Οι μέλισσες εκτρέφονται, επίσης, και για άλλα προϊόντα που παράγουν ή για την επικονιαστική τους δράση στα καλλιεργούμενα φυτά. Η μελισσοκομία αποτελεί μια από τις παλαιότερες μορφές κτηνοτροφίας.
scope note: Care and manipulation of honeybees to enable them to produce and store more honey than they need so that the excess can be collected. Honeybees are also kept for other products they produce or their services as pollinators of fruit and vegetable blossoms. Beekeeping is one of the oldest forms of animal husbandry. @en

Κτηνοτροφία
type: Concept
narrower: Μελισσοκομία
notation: 38
preferred label: Animal husbandry @en