HUMANITIES-THESAURUS
type: ConceptScheme

Hyponymy
type: Concept
narrower: Cohyponymy
notation: 1525
preferred label: Υπωνυμία @el

Cohyponymy
type: Concept
contributor: Κατσιαδάκη Ελένη (ΑΑ) @el
contributor: Katsiadakis Helen (AA)
created: 2019-05-20
creator: Karasimos Athanasios (AA) @fr
creator: Καρασίμος Αθανάσιος (ΑΑ) @el
modified: 2020-08-21
source: Crystal 2008
source: Saeed 2017
source: Ξυδόπουλος 2008
status: Εκδοθείς
alternative label: Co-hyponymy
broader: Hyponymy
in scheme: HUMANITIES-THESAURUS
notation: 1698
preferred label: Συνυπωνυμία @el
scope note: Το σύνολο των όρων οι οποίοι είναι υπώνυμα του ίδιου υπερκείμενου όρου ονομάζονται συνυπώνυμα, π.χ. βιολί, κιθάρα, πιάνο είναι συνεπώνυμα του όρου μουσικά όργανα. @el
scope note: Two or more predicates are co-hyponyms (or 'cohyponyms') when they are hyponyms of the same hyperonym. Example: 'dog' and 'cat' (common hyperonyms: animal, pet, mammal, etc. Co-hyponyms may or may not be incompatibles.