HUMANITIES-THESAURUS
type: ConceptScheme

Σχήματα λόγου
type: Concept
narrower: Μεταφορά (σχήμα λόγου)
notation: 1659
preferred label: Figures of speech @en

Μεταφορά (σχήμα λόγου)
type: Concept
contributor: Κατσιαδάκη Ελένη (ΑΑ)
contributor: Katsiadakis Helen (AA) @en
created: 2019-04-30
creator: Kalafata Patritsia (AA) @la
creator: Καλαφατά Πατρίτσια (ΑΑ)
modified: 2020-10-19
source: Λεξικό της κοινής νεοελληνικής 1998
source: Τζάρτζανος 1989
status: Εκδοθείς
broader: Σχήματα λόγου
in scheme: HUMANITIES-THESAURUS
notation: 1685
preferred label: Metaphor (figure of speech) @en
scope note: A figure of speech containing an implied comparison between two dissimilar things that have something in common. Ε.g. "gold coin" (literal meaning), "heart of gold" (metaphor). @en
scope note: Σχήμα λόγου κατά το οποίο η σημασία μιας λέξης επεκτείνεται αναλογικά και σε άλλες συγγενικές λέξεις, που συμβαίνει να έχουν κάποια μικρή ή μεγάλη ομοιότητα με αυτήν. Π.χ. "χρυσή λίρα" (κυριολεξία), "χρυσή καρδιά" (μεταφορά).