HUMANITIES-THESAURUS
type: ConceptScheme

Μεγαλογράμματη γραφή
type: Concept
narrower: Επισεσυρμένη γραφή
notation: 1636
preferred label: Majuscule script @en

Επισεσυρμένη γραφή
type: Concept
contributor: Κατσιαδάκη Ελένη (ΑΑ)
contributor: Katsiadakis Helen (AA) @en
created: 2019-03-29
creator: Chrysovitsanos Gerasimos (AA) @en
creator: Χρυσοβιτσάνος Γεράσιμος (ΑΑ)
modified: 2019-08-09
source: Κριτζάς (επιμ.) 2003
status: Εκδοθείς
alternative label: Koine script @en
alternative label: Κοινή γραφή
broader: Μεγαλογράμματη γραφή
in scheme: HUMANITIES-THESAURUS
notation: 1638
preferred label: Cursive script @en
scope note: Type of majuscule script for private documents during the Byzantine period @en
scope note: Τύπος μεγαλογράμματης γραφής που χρησιμοποιούνταν σε ιδιωτικά έγγραφα κατά τη Βυζαντινή περίοδο.