HUMANITIES-THESAURUS
type: ConceptScheme

Νομισματική
type: Concept
notation: 1444
preferred label: Numismatics @en
related: Εμπροσθότυποι

Νομίσματα (πληροφοριακά αντικείμενα)
type: Concept
notation: 1445
preferred label: Coins (information objects) @en
related: Εμπροσθότυποι

Εμπροσθότυποι
type: Concept
contributor: Ιακωβίδου Αθηνά (ΑΑ)
contributor: Iakovidou Athena (AA) @la
created: 2019-03-26
creator: Ιακωβίδου Αθηνά (ΑΑ)
creator: Iakovidou Athena (AA) @fr
modified: 2020-04-03
source: Meadows 2016
status: Εκδοθείς
broader: Συμβολικά αντικείμενα
in scheme: HUMANITIES-THESAURUS
notation: 1614
preferred label: Obverses @en
related: Νομισματική
related: Νομίσματα (πληροφοριακά αντικείμενα)
scope note: Οι παραστάσεις που έφεραν τα νομίσματα στην εμπρόσθια, την κύρια πλευρά και παράγονταν από τις αντίστοιχες σφραγίδες. Πολύ συχνά οι εν λόγω απεικονίσεις αφορούσαν πορτραίτα ή άλλη μορφή κεφαλών, οι οποίες, κάποιες φορές, κυρίως από τους ελληνιστικούς χρόνους και μετά, παρέχουν μια ένδειξη για την αρχή που ήταν υπεύθυνη για την κοπή του νομίσματος.
scope note: The depictions on the head's side of a coin, produced by the obverse die. They are most often potraits or other forms of head which sometimes, mainly from the Hellenistic period onwards, provide an indication of the authority responsible for issuing the coin. @en

Συμβολικά αντικείμενα
type: Concept
narrower: Εμπροσθότυποι
notation: 22
preferred label: Symbolic objects @en