HUMANITIES-THESAURUS
type: ConceptScheme

Αντωνυμία (Σχέση)
type: Concept
narrower: Διαβαθμισμένη αντωνυμία
notation: 1517
preferred label: Antonymy @en

Διαβαθμισμένη αντωνυμία
type: Concept
contributor: Katsiadakis Helen (AA) @en
contributor: Κατσιαδάκη Ελένη (ΑΑ)
created: 2019-03-14
creator: Karasimos Athanasios (AA) @en
creator: Καρασίμος Αθανάσιος (ΑΑ)
modified: 2020-05-27
source: Ξυδόπουλος 2008
source: Saeed 2017
status: Εκδοθείς
alternative label: Scalar antonymy
broader: Αντωνυμία (Σχέση)
in scheme: HUMANITIES-THESAURUS
notation: 1520
preferred label: Gradable antonymy @en
scope note: Gradable or scalar antonymy describes pairs of words that are contrasted with respect to their degree of possession of a certain semantic property. Each term represents or stands for an end-point (or extreme) on a scale (e.g., of temperature, size, height, beauty, etc.); between those end-points there are other intermediate points. @en
scope note: Η διαβαθμισμένη αντωνυμία δεν εκφράζει συμπληρωματική ή απόλυτη αντίθεση. Ακριβώς γι’ αυτό μπορούμε κανονικά να πούμε ότι κάποιος είναι πολύ/λίγο/αρκετά/λιγότερο ψηλός κλπ. Στην περίπτωση αυτή δηλαδή έχουμε μια διαβαθμισμένη σχέση στην οποία τα δύο αντώνυμα βρίσκονται στα άκρα ενός συνεχούς με πολλές ενδιάμεσες κατηγορίες. Στα διαβαθμισμένα αντώνυμα συμβαίνει πολλές φορές το ένα από τα δύο μέλη του ζεύγους να είναι η γενική, ουδέτερη λέξη που χρησιμοποιούμε όταν θέλουμε να μιλήσουμε για ύψος, βάρος, ταχύτητα κοκ.