HUMANITIES-THESAURUS
type: ConceptScheme

Σημασιολογικές σχέσεις
type: Concept
narrower: Αντωνυμία (Σχέση)
notation: 1513
preferred label: Semantic relations @en

Αντωνυμία (Σχέση)
type: Concept
contributor: Karasimos Athanasios (AA) @en
contributor: Καρασίμος Αθανάσιος (ΑΑ)
created: 2019-03-14
creator: Karasimos Athanasios (AA) @fr
creator: Καρασίμος Αθανάσιος (ΑΑ)
modified: 2020-07-15
source: Zapata 2008
source: Ξυδόπουλος 2008
source: Saeed 2017
status: Εκδοθείς
broader: Σημασιολογικές σχέσεις
in scheme: HUMANITIES-THESAURUS
narrower: Μη διαβαθμισμένη αντωνυμία
narrower: Συσχετιστική αντωνυμία
narrower: Διαβαθμισμένη αντωνυμία
notation: 1517
preferred label: Antonymy @en
scope note: Antonymy is the semantic relationship that exists between two (or more) words that have opposite meanings. The pairs of words which have opposite meanings are called antonyms. Antonymous pairs of words usually belong to the same grammatical category (i.e., both elements are nouns, or both are adjectives, or both are verbs, and so on). @en
scope note: Η αντωνυμία χρησιμοποιείται στη σημασιολογία ως μέρος της μελέτης της αντιθετικότητας της σημασίας. Η αντωνυμία είναι μία από τις εννοιακές σχέσεις που αναγνωρίζεται σε αναλύσεις της σημασίας μαζί με τη συνωνυμία, την υπωνυμία, την ασυμβατότητα, κτλ. Με τη γενικότερη έννοιά του, ο όρος αναφέρεται συνολικά σε όλα τα είδη σημασιολογικής αντιθετικότητας συμπεριλαμβανομένων και των διαβαθμίσεων αντίθεσης.

Μη διαβαθμισμένη αντωνυμία
type: Concept
broader: Αντωνυμία (Σχέση)
notation: 1519
preferred label: Ungraded antonymy @en

Διαβαθμισμένη αντωνυμία
type: Concept
broader: Αντωνυμία (Σχέση)
notation: 1520
preferred label: Gradable antonymy @en

Συσχετιστική αντωνυμία
type: Concept
broader: Αντωνυμία (Σχέση)
notation: 1689
preferred label: Relational antonymy @en