HUMANITIES-THESAURUS
type: ConceptScheme

Επιστημικές κοινότητες
type: Concept
contributor: Katsiadakis Helen (AA) @en
contributor: Κατσιαδάκη Ελένη (ΑΑ)
created: 2018-10-12
creator: Μεργούπη-Σαβαΐδου Ειρήνη (ΑΑ)
creator: Mergoupi-Savaidou Eirini (AA) @de
modified: 2019-09-23
source: Haas 1992
status: Εκδοθείς
broader: Κοινότητες (συλλογικότητες)
in scheme: HUMANITIES-THESAURUS
notation: 1460
preferred label: Epistemic communities @en
scope note: Δίκτυα ειδικών με αναγνωρισμένη αρμοδιότητα και έγκριτο λόγο πάνω σε ζητήματα του τομέα τους που σχετίζονται με την πολιτική. Τα εν λόγω δίκτυα συνέχονται στη βάση των κοινών κανονιστικών πεποιθήσεων και αρχών των μελών τους, των κοινών αντιλήψεών τους για τις σχέσεις αιτίας-αποτελέσματος, των κοινών κριτηρίων επιστημονικής εγκυρότητας της γνώσης και των κοινών αξιών και πρακτικών τους ως προς την κατεύθυνση και την εφαρμογή πολιτικών.
scope note: Networks of experts with recognised competence and authoritative claim to policy-relevant knowledge within their domain. These experts have a shared set of normative and principled beliefs, shared causal beliefs, shared notions of validity and shared values and practices about policy direction and implementation. @en

Κοινότητες (συλλογικότητες)
type: Concept
narrower: Επιστημικές κοινότητες
notation: 208
preferred label: Communities (collectivities) @en