HUMANITIES-THESAURUS
type: ConceptScheme

Νομισματική
type: Concept
notation: 1444
preferred label: Numismatics @en
related: Έκκεντρα νομίσματα

Έκκεντρα νομίσματα
type: Concept
contributor: Κατσιαδάκη Ελένη (ΑΑ)
contributor: Katsiadakis Helen (AA) @en
created: 2018-09-01
creator: Ιακωβίδου Αθηνά (ΑΑ)
creator: Iakovidou Athena (AA) @fr
modified: 2020-04-03
source: Amandry, Dhénin, Popoff, Thierry, & Vellet 2002
status: Εκδοθείς
broader: Νομίσματα (υλικό)
in scheme: HUMANITIES-THESAURUS
notation: 1452
preferred label: Off-center coins @en
related: Νομισματική
scope note: Νομίσματα στα οποία, κατά την παραγωγή τους, ο δίσκος δεν τοποθετήθηκε παράλληλα κεντραρισμένος στην μήτρα. Ως αποτέλεσμα του λάθους αυτού, ένα τμήμα της παράστασης λείπει από το νόμισμα.
scope note: An off-center coin is a coin struck on a blank flan that was not properly centered on the die. As a consequence of this mistake, part of the design is missing from the coin. @en

Νομίσματα (υλικό)
type: Concept
narrower: Έκκεντρα νομίσματα
notation: 2349
preferred label: Coins (material) @en