HUMANITIES-THESAURUS
type: ConceptScheme

Νομισματική
type: Concept
notation: 1444
preferred label: Numismatics @en
related: Διπλοχτυπημένα νομίσματα

Διπλοχτυπημένα νομίσματα
type: Concept
contributor: Κατσιαδάκη Ελένη (ΑΑ)
contributor: Katsiadakis Helen (AA) @en
created: 2018-08-31
creator: Ιακωβίδου Αθηνά (ΑΑ)
creator: Iakovidou Athena (AA) @fr
modified: 2020-04-03
source: Amandry, Dhénin, Popoff, Thierry, & Vellet 2002
status: Εκδοθείς
broader: Νομίσματα (υλικό)
in scheme: HUMANITIES-THESAURUS
notation: 1451
preferred label: Double struck coins @en
related: Νομισματική
scope note: Νομίσματα των οποίων η εμπρόσθια ή η οπίσθια όψη έχει χτυπηθεί από την αντίστοιχη μήτρα δύο φορές. Ως αποτέλεσμα της πράξης αυτής, εσκεμμένης ή μη, σημεία της παράστασης μπορεί να είναι διακριτά δύο φορές.
scope note: The term refers to coins whose obverse or reverse has been struck twice by the respective die. As a consequence of this action, deliberate or not, parts of the design may be visible twice. @en

Νομίσματα (υλικό)
type: Concept
narrower: Διπλοχτυπημένα νομίσματα
notation: 2349
preferred label: Coins (material) @en