HUMANITIES-THESAURUS
type: ConceptScheme

Νομισματική
type: Concept
notation: 1444
preferred label: Numismatics @en
related: Κοιλόκυρτα νομίσματα

Κοιλόκυρτα νομίσματα
type: Concept
contributor: Κατσιαδάκη Ελένη (ΑΑ)
contributor: Katsiadakis Helen (AA) @en
created: 2018-08-27
creator: Iakovidou Athena (AA) @fr
creator: Ιακωβίδου Αθηνά (ΑΑ)
modified: 2020-04-04
source: Κρεμύδη 2009
status: Εκδοθείς
broader: Νομίσματα (υλικό)
in scheme: HUMANITIES-THESAURUS
notation: 1450
preferred label: Incuse coins @en
related: Νομισματική
scope note: Νομίσματα στα οποία το θέμα του εμπροσθοτύπου αναπαράγεται σε κυρτή μορφή στον οπισθότυπο. Το αποτέλεσμα αυτό επιτυγχάνεται με τη χρήση μιας κοίλης μήτρας. Η εν λόγω τεχνική ήταν ιδιαίτερα δημοφιλής στις ελληνικές πόλεις της Νότιας Ιταλίας κατά τον 6ο και 5ο αι. π.Χ.
scope note: Coins which exhibit the same image, concave on one side, convex on the other. This technique was achieved by using a concave cast and was popular in the Greek cities of South Italy during the 6th and 5th c. BCE. @en

Νομίσματα (υλικό)
type: Concept
narrower: Κοιλόκυρτα νομίσματα
notation: 2349
preferred label: Coins (material) @en