HUMANITIES-THESAURUS
type: ConceptScheme

Νομισματική
type: Concept
notation: 1444
preferred label: Numismatics @en
related: Χαλκοί

Νομίσματα (πληροφοριακά αντικείμενα)
type: Concept
narrower: Χαλκοί
notation: 1445
preferred label: Coins (information objects) @en

Οβολοί (νομίσματα)
type: Concept
notation: 1447
preferred label: Obols (coins) @en
related: Χαλκοί

Χαλκοί
type: Concept
contributor: Katsiadakis Helen (AA) @en
contributor: Κατσιαδάκη Ελένη (ΑΑ)
created: 2018-08-27
creator: Ιακωβίδου Αθηνά (ΑΑ)
creator: Iakovidou Athena (AA) @de
modified: 2020-04-05
source: Amandry, Dhénin, Popoff, Thierry, & Vellet 2002
status: Εκδοθείς
broader: Νομίσματα (πληροφοριακά αντικείμενα)
in scheme: HUMANITIES-THESAURUS
notation: 1449
preferred label: Chalkoi @en
related: Χάλκινα νομίσματα
related: Νομισματική
related: Οβολοί (νομίσματα)
scope note: Bronze fractions of the obol. In Greece proper they were first introduced in Corinth at the end of the 5th c. BCE. According to ancient sources their value was equivalent to 1/8 of the obol or more often to 1/12 of it. @en
scope note: Χάλκινες υποδιαιρέσεις του οβολού. Στην Κυρίως Ελλάδα πρωτοεμφανίστηκαν στην Κόρινθο στο τέλος του 5ου αι. π.Χ. Σύμφωνα με τις πηγές, η αξία τους ισούταν με το 1/8 του οβολού ή πιο συχνά με το 1/12 αυτού.

Χάλκινα νομίσματα
type: Concept
notation: 2352
preferred label: Bronze coins @en
related: Χαλκοί