HUMANITIES-THESAURUS
type: ConceptScheme

Παύση (Αφηγηματολογία-Μέθοδοι)
type: Concept
narrower: Συλλογιστική παρέκβαση
notation: 1174
preferred label: Pause (Narratology-Methods) @en

Συλλογιστική παρέκβαση
type: Concept
contributor: Κατσιαδάκη Ελένη (ΑΑ)
contributor: Katsiadakis Helen (AA) @en
created: 2015-10-06
creator: Καλαφατά Πατρίτσια (ΑΑ)
creator: Kalafata Patritsia (AA) @la
modified: 2019-01-14
source: Burroway & Stuckey-French 2015
status: Εκδοθείς
alternative label: Σχόλιο
broader: Παύση (Αφηγηματολογία-Μέθοδοι)
in scheme: HUMANITIES-THESAURUS
notation: 1413
preferred label: Digression @en
scope note: Αφηγηματικός τρόπος κατά τον οποίο κάποιο σχόλιο ή στοχασμός του αφηγητή ανακόπτει την πορεία της δράσης και οδηγεί σε παύση της αφήγησης τροποποιώντας τον αφηγηματικό ρυθμό.
scope note: A narrative technique in which a narrator’s comment interrupts the story-time, while the narrative time continues. This take place, for example, when the narrator interrupts the progression of the story in order to hold forth about general problems, to comment on the characters’ behavior, or to reflect on the act of narration. @en