HUMANITIES-THESAURUS
type: ConceptScheme

Computational Linguistics
type: Concept
narrower: Computational lexicography
notation: 1296
preferred label: Υπολογιστική Γλωσσολογία @el
preferred label: Computerlinguistik @de
preferred label: Linguistique informatique @fr

Computational lexicography
type: Concept
contributor: Κατσιαδάκη Ελένη (ΑΑ) @el
contributor: Katsiadakis Helen (AA)
created: 2015-01-26
creator: Karasimos Athanasios (AA)
creator: Καρασίμος Αθανάσιος (ΑΑ) @el
modified: 2015-11-02
source: Atkins & Rundell 2008
source: Boguraev & Briscoe 1989
source: Jurafsky & Martin 2013
status: Εκδοθείς
broader: Computational Linguistics
in scheme: HUMANITIES-THESAURUS
notation: 1356
preferred label: Lexicographie informatique @fr
preferred label: Υπολογιστική Λεξικογραφία @el
preferred label: Computerlexicographie @de
scope note: (i) Λεξικογραφία με τη χρήση ηλεκτρονικών υπολογιστών ως βοήθεια για τη δημιουργία και σύνταξη των λεξικών. (ii) Η χρήση των υπαρχόντων λεξικών για σκοπούς που δεν έχουν σχεδιαστεί, δηλαδή για εφαρμογές στην επεξεργασία φυσικής γλώσσας από ένα ηλεκτρονικό υπολογιστή. @el
scope note: Computational lexicology is that branch of computational linguistics, which is concerned with the use of computers in the study of lexicon. It has been more narrowly described by several researchers as the use of computers in the study of machine-readable dictionaries. It is distinguished from computational lexicography, which more properly would be the use of computers in the construction of dictionaries, though some researchers have used computational lexicography as synonymous.