HUMANITIES-THESAURUS
type: ConceptScheme

Ταμπού
type: Concept
contributor: Katsiadakis Helen (AA) @en
contributor: Κατσιαδάκη Ελένη (ΑΑ)
created: 2015-04-17
creator: Souyioultzoglou Iraklitos (AA) @de
creator: Σουγιουλτζόγλου Ηράκλειτος (ΑΑ)
modified: 2020-05-06
source: Webster 1942
status: Εκδοθείς
broader: Προτασιακά αντικείμενα
in scheme: HUMANITIES-THESAURUS
narrower: Ταμπού της αιμομιξίας
notation: 135
preferred label: Taboos @en
scope note: Σύνολο απαγορευτικών κανόνων που αφορούν σε πράξεις, αντικείμενα και όντα που θεωρούνται ιερά ή μιαρά. Η παραβίαση των κανόνων αυτών συνεπάγεται κυρώσεις ή επιφέρει την τιμωρία από υπερφυσικές δυνάμεις.
scope note: Prohibitive rules with relevance to sacred and/or profane acts, objects and entities. The violation of these rules entails sanctions or punishment by supernatural forces. @en

Προτασιακά αντικείμενα
type: Concept
narrower: Ταμπού
notation: 25
preferred label: Propositional objects @en

Ταμπού της αιμομιξίας
type: Concept
broader: Ταμπού
notation: 695
preferred label: Incest taboo @en