HUMANITIES-THESAURUS
type: ConceptScheme

In media res
type: Concept
contributor: Καλαφατά Πατρίτσια (ΑΑ)
contributor: Kalafata Patritsia (AA) @en
created: 2015-10-05
creator: Kalafata Patritsia (AA) @la
creator: Καλαφατά Πατρίτσια (ΑΑ)
modified: 2018-11-20
source: Λεξικό Λογοτεχνικών Όρων 2010
status: Εκδοθείς
broader: Αναχρονίες (Αφηγηματολογία-Μέθοδοι)
in scheme: HUMANITIES-THESAURUS
notation: 1311
scope note: The narrative technique in which the narration doesn’t start at the beginning but "in media res", that is at a crucial point in the middle of the action. @en
scope note: Αφηγηματικός τρόπος κατά τον οποίο η αφήγηση δεν ξεκινά από την αρχή αλλά από το "κέντρο" του μύθου, δηλαδή από το πιο καίριο και ουσιαστικό περιστατικό.

Αναχρονίες (Αφηγηματολογία-Μέθοδοι)
type: Concept
narrower: In media res
notation: 852
preferred label: Anachronies (Narratology-Methods) @en