HUMANITIES-THESAURUS
type: ConceptScheme

Δικαστική Γλωσσολογία
type: Concept
contributor: Katsiadakis Helen (AA) @en
contributor: Κατσιαδάκη Ελένη (ΑΑ)
created: 2015-05-15
creator: Karasimos Athanasios (AA) @fr
creator: Καρασίμος Αθανάσιος (ΑΑ)
modified: 2015-11-02
source: Andreou 2013
source: Coulthard & Johnson 2007
source: Olsson & Luchjenbroers 2013
status: Εκδοθείς
alternative label: Εγκληματολογική Γλωσσολογία
alternative label: Ανακριτική Γλωσσολογία
alternative label: Δικανική Γλωσσολογία
broader: Μακρογλωσσολογία
in scheme: HUMANITIES-THESAURUS
notation: 1283
preferred label: Linguistique judiciaire @fr
preferred label: Forensische Linguistik @de
preferred label: Forensic Linguistics @en
scope note: Η Δικαστική Γλωσσολογία εφαρμόζει τις γνώσεις και μεθόδους της γλωσσολογίας σε οποιαδήποτε γλωσσικά δεδομένα σχετίζονται με το νομικό σύστημα και την εγκληματολογική έρευνα. Διακρίνεται σε α) έρευνα στη γλώσσα των νομικών κειμένων (ανάλυση της γραπτής γλώσσας που χρησιμοποιείται στα νομικά κείμενα), β) έρευνα στην προφορική γλώσσα του νομικού συστήματος (ανάλυση της γλώσσας που χρησιμοποιείται στο δικαστήριο, στην αστυνομική ανάκριση, στις υπό κάλυψη επιχειρήσεις, στις κλήσεις έκτακτης ανάγκης) και γ) έρευνα της γλώσσας ως αποδεικτικού στοιχείου (ανάλυση γλωσσικών δεδομένων - γραπτά ή προφορικά κείμενα- τα οποία αποτελούν μέρος του εγκλήματος και της εγκληματολογικής έρευνας).
scope note: Forensic linguistics, legal linguistics, or language and the law, is the application of linguistic knowledge, methods and insights to the forensic context of law, language, crime investigation, trial, and judicial procedure. It is a branch of applied linguistics.There are principally three areas of application for linguists working in forensic contexts: understanding language of the written law, understanding language use in forensic and judicial processes, and the provision of linguistic evidence. @en

Μακρογλωσσολογία
type: Concept
narrower: Δικαστική Γλωσσολογία
notation: 933
preferred label: Macrolinguistique @fr
preferred label: Macrolinguistics @en