HUMANITIES-THESAURUS
type: ConceptScheme

Σκηνικοί χώροι
type: Concept
contributor: Katsiadakis Helen (AA) @en
contributor: Κατσιαδάκη Ελένη (ΑΑ)
created: 2015-10-21
creator: Γουλή Ελένη (ΑΑ)
creator: Goulis Helen (AA) @la
modified: 2019-02-12
source: Pavis 2007
source: Πούχνερ 2011
status: Εκδοθείς
broader: Δομικά μέρη υλικών αντικειμένων
in scheme: HUMANITIES-THESAURUS
narrower: Σκηνικά
narrower: Σκηνές (χώροι)
notation: 128
preferred label: Espaces scéniques @fr
preferred label: Stage spaces @en
preferred label: Bühnenräume @de
related: Δραματικοί χώροι
scope note: Ως σκηνικός νοείται ο χώρος της σκηνής και του σκηνικού με τις ποικίλες εκδοχές που είχε στην ιστορία του θεάτρου (μόνιμο, εναλλασσόμενο, ρεαλιστικό, υπαινικτικό, απουσία σκηνικού, ζωγραφισμένο σε κουίντες, κτισμένο κ.λπ.). Ο όρος περιλαμβάνει επίσης τις καταπακτές, την περιστρεφόμενη σκηνή, άλλες τεχνικές εγκαταστάσεις και συστήματα φωτισμού.
scope note: Stage space is the actual space on stage and the set in its multiple variations in the course of theatre history (permanent, changing, no set at all, realistic, suggestive, painted on wings, built etc.). It comprises also the trap doors, the revolving stage, the other technical equipment and lighting systems. @en

Δομικά μέρη υλικών αντικειμένων
type: Concept
narrower: Σκηνικοί χώροι
notation: 17
preferred label: Structural parts of material objects @en

Σκηνικά
type: Concept
broader: Σκηνικοί χώροι
notation: 2176
preferred label: Bühnenbilder @de
preferred label: Sets (Perfroming arts) @en
preferred label: Décors (Arts du spectacle) @fr

Σκηνές (χώροι)
type: Concept
broader: Σκηνικοί χώροι
notation: 683
preferred label: Stages @en
preferred label: Scènes (espaces) @fr
preferred label: Bühne @de

Δραματικοί χώροι
type: Concept
notation: 728
preferred label: Dramatic spaces @en
preferred label: Espaces dramatiques @fr
preferred label: Dramatische Räume @de
related: Σκηνικοί χώροι