HUMANITIES-THESAURUS
type: ConceptScheme

Έλλειψη (Αφηγηματολογία-Μέθοδοι)
type: Concept
contributor: Katsiadakis Helen (AA) @en
contributor: Κατσιαδάκη Ελένη (ΑΑ)
created: 2015-10-06
creator: Καλαφατά Πατρίτσια (ΑΑ)
creator: Kalafata Patritsia (AA) @la
modified: 2019-01-14
source: Τζιόβας 2003
status: Εκδοθείς
broader: Ανισοχρονίες (Αφηγηματολογία-Μέθοδοι)
in scheme: HUMANITIES-THESAURUS
notation: 1226
preferred label: Ellipsis (Narratology-Methods) @en
scope note: The narrative device of omitting a portion of the sequence of events, and of taking a chronological leap to a future point of the plot. With this tecnique the plot advancement is accelerated. @en
scope note: Αφηγηματικός τρόπος ο οποίος συνίσταται στην αποσιώπηση ενός τμήματος της ιστορίας με χρονικό άλμα σε μεταγενέστερο σημείο. Με αυτόν τον αφηγηματικό τρόπο επιταχύνεται η εξέλιξη της αφήγησης.

Ανισοχρονίες (Αφηγηματολογία-Μέθοδοι)
type: Concept
narrower: Έλλειψη (Αφηγηματολογία-Μέθοδοι)
notation: 730
preferred label: Anisochronies (Narratology-Methods) @en