HUMANITIES-THESAURUS
type: ConceptScheme

Objective genitive
type: Concept
contributor: Katsiadakis Helen (AA)
contributor: Κατσιαδάκη Ελένη (ΑΑ) @el
created: 2015-07-03
creator: Chatzimichail Christos (AA)
creator: Χατζημιχαήλ Χρήστος (ΑΑ) @el
modified: 2020-04-08
source: Μπαχαράκης 2010
status: Εκδοθείς
broader: Attribute in the genitive case
in scheme: HUMANITIES-THESAURUS
notation: 1224
preferred label: Γενική αντικειμενική @el
scope note: Ο ονοματικός προσδιορισμός σε γενική πτώση, ο οποίος εκφράζει το αντικείμενο της ρηματικής ενέργειας, που υποδηλώνεται με το προσδιοριζόμενο ρηματικό όνομα (ουσιαστικό ή επίθετο). @el
scope note: The nominal phrase in the genitive case, which expresses the object of the verbal action, denoted by the identified verbal name (noun or adjective).

Attribute in the genitive case
type: Concept
narrower: Objective genitive
notation: 958
preferred label: Προσδιορισμός σε γενική πτώση @el