HUMANITIES-THESAURUS
type: ConceptScheme

Αισυμνητεία
type: Concept
contributor: Katsiadakis Helen (AA) @en
contributor: Κατσιαδάκη Ελένη (ΑΑ)
created: 2015-08-04
creator: Σίνου Χριστίνα (ΑΑ)
creator: Sinou Christina (AA) @la
modified: 2020-04-23
source: Ross 1991
source: Λεκατσάς 1939
source: Bonitz 1870
source: Duering 1994
status: Εκδοθείς
alternative label: Elective tyranny @en
alternative label: Αιρετή τυραννίδα
broader: Εξουσία του Ενός
in scheme: HUMANITIES-THESAURUS
notation: 1209
preferred label: The rule of Aesymnetes @en
scope note: Το πολίτευμα, κατά τον Αριστοτέλη, που συνδυάζει τη βασιλεία και την τυραννία, σύμφωνα με το οποίο σε κρίσιμες περιπτώσεις την άσκηση της εξουσίας την αναλαμβάνει ένα πρόσωπο εγνωσμένης αξίας και κοινής αποδοχής από την κοινωνία. Γνωστοί αισυμνήτες της αρχαιότητας ήταν ο Σόλων στην Αθήνα και ο Πιττακός στη Λέσβο.

Εξουσία του Ενός
type: Concept
narrower: Αισυμνητεία
notation: 670
preferred label: One man rule @en