HUMANITIES-THESAURUS
type: ConceptScheme

Παύση (Αφηγηματολογία-Μέθοδοι)
type: Concept
contributor: Katsiadakis Helen (AA) @en
contributor: Κατσιαδάκη Ελένη (ΑΑ)
created: 2015-10-06
creator: Kalafata Patritsia (AA) @la
creator: Καλαφατά Πατρίτσια (ΑΑ)
modified: 2019-01-14
source: Τζούμα 1997
status: Εκδοθείς
broader: Ανισοχρονίες (Αφηγηματολογία-Μέθοδοι)
in scheme: HUMANITIES-THESAURUS
narrower: Περιγραφική παύση
narrower: Συλλογιστική παρέκβαση
notation: 1174
preferred label: Pause (Narratology-Methods) @en
scope note: Αφηγηματικός τρόπος κατά τον οποίο ο χρόνος της αφήγησης είναι απείρως μεγαλύτερος από τον χρόνο της ιστορίας. Η χρήση της παύσης απαντά κυρίως στις περιγραφές ή στα σχόλια, και πιο συγκεκριμένα σε αυτά που γίνονται από τον αφηγητή με σταμάτημα της υπόθεσης (ανακόπτεται η πορεία της δράσης) και διακοπή της διάρκειας της ιστορίας.
scope note: A narrative technique in which the story-time comes to a standstill, while the narrative time continues. In other words the event-story is interrupted to make room exclusively for narratorial discourse. Static descriptions or narrator's comments fall into this category. @en

Περιγραφική παύση
type: Concept
broader: Παύση (Αφηγηματολογία-Μέθοδοι)
notation: 1386
preferred label: Descriptive pause @en

Συλλογιστική παρέκβαση
type: Concept
broader: Παύση (Αφηγηματολογία-Μέθοδοι)
notation: 1413
preferred label: Digression @en

Ανισοχρονίες (Αφηγηματολογία-Μέθοδοι)
type: Concept
narrower: Παύση (Αφηγηματολογία-Μέθοδοι)
notation: 730
preferred label: Anisochronies (Narratology-Methods) @en