HUMANITIES-THESAURUS
type: ConceptScheme

Εκδοτικά επιγραφικά σύμβολα
type: Concept
contributor: Katsiadakis Helen (AA) @en
contributor: Κατσιαδάκη Ελένη (ΑΑ)
created: 2015-07-02
creator: Χρυσοβιτσάνος Γεράσιμος (ΑΑ)
creator: Chrysovitsanos Gerasimos (AA) @de
modified: 2018-12-03
source: Woodhead 2009
status: Εκδοθείς
broader: Συμβολικά αντικείμενα
in scheme: HUMANITIES-THESAURUS
notation: 117
preferred label: Editorial epigraphic symbols @en
related: Επιγραφική
scope note: Ένα σύνολο κοινώς αποδεκτών συμβόλων, τα οποία επιτρέπουν την τυπογραφική έκδοση των κειμένων των επιγραφών και βοηθούν στο να αποδοθούν οι αποκαταστάσεις και οι διορθώσεις που προτείνουν οι μελετητές για το σωζόμενο κείμενο της επιγραφής.
scope note: A set of commonly accepted symbols that allow the printed version of the texts of inscriptions and help to reproduce the restorations and corrections proposed by scholars for the preserved text of the inscription. @en

Συμβολικά αντικείμενα
type: Concept
narrower: Εκδοτικά επιγραφικά σύμβολα
notation: 22
preferred label: Symbolic objects @en

Επιγραφική
type: Concept
notation: 573
preferred label: Epigraphy @en
related: Εκδοτικά επιγραφικά σύμβολα