HUMANITIES-THESAURUS
type: ConceptScheme

Θέμα (Γλωσσολογία)
type: Concept
contributor: Κατσιαδάκη Ελένη (ΑΑ)
contributor: Katsiadakis Helen (AA) @en
created: 2015-01-27
creator: Karasimos Athanasios (AA) @la
creator: Καρασίμος Αθανάσιος (ΑΑ)
modified: 2015-11-02
source: Bloomfield 1933
source: Carstairs-McCarthy 1992
source: Matthews 1974
source: Booij 2007
source: Ράλλη 2005
status: Εκδοθείς
alternative label: Βάση
alternative label: Ρίζα
alternative label: Root @en
alternative label: Base @en
broader: Δεσμευμένο μόρφημα
in scheme: HUMANITIES-THESAURUS
notation: 1150
preferred label: Thème (Linguistique) @fr
preferred label: Stem (Linguistics) @en
preferred label: Stamm (Linguistik) @de
scope note: A stem is a part of a word. The term is used with slightly different meanings.In one usage, a stem is a form to which affixes can be attached. Thus, in this usage, the English word improvements contains the stem 'improve', to which the derivational suffix '-ment' is attached to form a new stem 'improvement', to which the inflectional suffix '-s' is attached. In a variant of this usage, the root of the word (in the example, improve) is not counted as a stem. @en
scope note: Το σταθερό τμήμα κάθε κλιτής λέξης. Τα λεξικά μορφήματα αποτελούν το θέμα μιας λέξης (π.χ. στη λέξη άνθρωπος το θέμα είναι το ανθρωπ-, ενώ η σύνθετη λέξη τραπεζομάχαιρο αποτελείται από δύο θέματα, τα τραπεζ- και μαχαιρ-) κατά τη συγχρονική μορφολογική ανάλυση. Εάν η οπτική γωνία της ανάλυσης είναι ετυμολογική, τα θέματα ορίζονται και ως ρίζες (π.χ. στη λέξη πρωτοβουλία, που δεν είναι συγχρονικά αναλύσιμη, διακρίνονται ετυμολογικά οι ρίζες πρωτ- και βούλ-). Να σημειωθεί ότι η ρίζα μπορεί να περιέχει μόνο το θέμα ή και κάποιο άλλο συστατικό (π.χ. στη λέξη χρονικός η ρίζα είναι το χρονικ- που αποτελείται από το θέμα χρον- και το επίθημα -ικ-).

Δεσμευμένο μόρφημα
type: Concept
narrower: Θέμα (Γλωσσολογία)
notation: 849
preferred label: Morphème attaché @fr
preferred label: Gebundenes Morphem @de
preferred label: Bound morpheme @en