HUMANITIES-THESAURUS
type: ConceptScheme

Εσωτερικός μονόλογος
type: Concept
contributor: Κατσιαδάκη Ελένη (ΑΑ)
contributor: Katsiadakis Helen (AA) @en
created: 2015-10-13
creator: Καλαφατά Πατρίτσια (ΑΑ)
creator: Kalafata Patritsia (AA) @la
modified: 2018-11-09
source: Genette, Marin, Mathieu-Colas 1988
status: Εκδοθείς
broader: Εσωτερική εστίαση
in scheme: HUMANITIES-THESAURUS
notation: 1146
preferred label: Interior monologue @en
preferred label: Monologue intérieur @fr
scope note: Narrative technique which consists of the direct, immediate presentation of the unspoken thoughts of a character without any intervening narrator. @en
scope note: Αφηγηματικός τρόπος που στόχο έχει να φέρει στην επιφάνεια την αδιάκοπη ροή σκέψεων και συνειρμών του ήρωα. Με την τεχνική αυτή δίνεται η εντύπωση ότι παρακολουθεί κανείς την εσωτερική ζωή του ήρωα χωρίς την παρέμβαση του συγγραφέα.

Εσωτερική εστίαση
type: Concept
narrower: Εσωτερικός μονόλογος
notation: 800
preferred label: Internal focalization @en