HUMANITIES-THESAURUS
type: ConceptScheme

Μοντερνισμός
type: Concept
contributor: Βερναρδάκη Ελένη (ΑΑ)
contributor: Vernardaki Eleni (AA) @fr
created: 2015-10-29
creator: Ξηροπαϊδης Γιώργος (ΑΣΚΤ)
creator: Xiropaidis Georgios (ASFA) @de
modified: 2019-11-20
source: Λυδάκης 2009
source: The J. Paul Getty Trust 2015
status: Εκδοθείς
broader: Καλλιτεχνικά ρεύματα
in scheme: HUMANITIES-THESAURUS
notation: 113
preferred label: Modernism @en
related: Μοντέρνα Τέχνη
scope note: The term refers to the succession of 20th-century avant-garde art and architectural movements formed in a reaction to social modernity. Modernism was eclipsed by the Post-Modernism movement which began in the 1970s. @en
scope note: Με τον όρο αυτό χαρακτηρίζονται όχι μόνο οι τεχνικές και αισθητικές προϋποθέσεις του έργου τέχνης αλλά και τα ιστορικοπνευματικά δεδομένα στα οποία βασίζεται. Αντιτίθεται στην παράδοση και αναζητεί ανεξάρτητες από αυτήν εκφραστικές νόρμες. Τον Mοντερνισμό διαδέχθηκε το κίνημα του Mεταμοντερνισμού που ξεκίνησε περί το 1970.

Μοντέρνα Τέχνη
type: Concept
notation: 150
preferred label: Modern Art @en
related: Μοντερνισμός

Καλλιτεχνικά ρεύματα
type: Concept
narrower: Μοντερνισμός
notation: 27