HUMANITIES-THESAURUS
type: ConceptScheme

Ημερολόγια θυσιών (Επιγραφές θρησκευτικού χαρακτήρα)
type: Concept
contributor: Κατσιαδάκη Ελένη (ΑΑ)
contributor: Katsiadakis Helen (AA) @en
created: 2014-12-15
creator: Χρυσοβιτσάνος Γεράσιμος (ΑΑ)
creator: Chrysovitsanos Gerasimos (AA) @fr
modified: 2018-12-03
source: Guarducci 2008
source: Bispham 2006
status: Εκδοθείς
broader: Επιγραφές θρησκευτικού χαρακτήρα
in scheme: HUMANITIES-THESAURUS
notation: 1083
preferred label: Sacred calendars (Religious inscriptions) @en
related: Επιγραφική
scope note: Επιγραφές που καταγράφουν κατά μήνα στις μέρες που προβλεπόταν να γίνουν θυσίες, στο όνομα της θεότητας για την οποία προοριζόταν η θυσία, στη θέση του ιερού όπου θα λάμβανε χώρα η τελετουργία, στο θυσιαζόμενο ζώο, καθώς και στο σύνολο της δαπάνης για τη θυσία.
scope note: Inscriptions indicating by month the days devoted to offering sacrifices, the name of the deity for whom the sacrifice was intended, the location of the sanctuary where the ritual would take place, the sacrificial animal, and the total cost of the sacrifice. @en

Επιγραφές θρησκευτικού χαρακτήρα
type: Concept
narrower: Ημερολόγια θυσιών (Επιγραφές θρησκευτικού χαρακτήρα)
notation: 569
preferred label: Religious inscriptions @en

Επιγραφική
type: Concept
notation: 573
preferred label: Epigraphy @en
related: Ημερολόγια θυσιών (Επιγραφές θρησκευτικού χαρακτήρα)